Target
Serine/threonine-protein kinase 17A
Ligand
BDBM50166271
Substrate
Meas. Tech.
ChEMBL_1575377 (CHEMBL3802095)
IC50
24±n/a nM
Citation
 Jung, MEByun, BJKim, HMLee, JYPark, JHLee, NSon, YHChoi, SUYang, KMKim, SJLee, KKim, YCChoi, G Discovery of indirubin derivatives as new class of DRAK2 inhibitors from high throughput screening. Bioorg Med Chem Lett 26:2719-23 (2016)  
Target
Name:
Serine/threonine-protein kinase 17A
Synonyms:
DRAK1 STK17A
Type:
Enzyme Catalytic Domain
Mol. Mass.:
46544.04
Organism:
Homo sapiens (Human)
Description:
gi_109255245
Residue:
414
  
Inhibitor
Name:
BDBM50166271
Synonyms:
CHEMBL3798563
Type:
Small organic molecule
Emp. Form.:
C23H14N6O7
Mol. Mass.:
486.3933
SMILES:
O\N=C1\C(\Nc2ccccc\12)=C1\C(=O)Nc2ccc(NC(=O)c3cc(cc(c3)[N+]([O-])=O)[N+]([O-])=O)cc12
: