Target
Serine/threonine-protein kinase B-raf
Ligand
BDBM99471
Substrate
Meas. Tech.
ChEMBL_1574288 (CHEMBL3802673)
IC50
15±n/a nM
Citation
 Li, XShen, JTan, LZhang, ZGao, DLuo, JCheng, HZhou, XMa, JDing, KLu, X Design and synthesis of N-(4-aminopyridin-2-yl)amides as B-Raf(V600E) inhibitors. Bioorg Med Chem Lett 26:2760-2763 (2016)  
Target
Name:
Serine/threonine-protein kinase B-raf
Synonyms:
B-RAF B-Raf proto-oncogene serine/threonine-protein kinase BRAF1 RAFB1 v-Raf murine sarcoma viral oncogene homolog B1
Type:
Serine/threonine-protein kinase
Mol. Mass.:
84446.00
Organism:
Homo sapiens (Human)
Description:
P15056
Residue:
766
  
Inhibitor
Name:
BDBM99471
Synonyms:
US8497274, 32
Type:
Small organic molecule
Emp. Form.:
C27H18F4N4O3S
Mol. Mass.:
554.515
SMILES:
Fc1ccc(Oc2ccc3nc(NC(=O)C4CC4)sc3c2C#N)cc1NC(=O)Cc1cccc(c1)C(F)(F)F
: