Target
Carbonic anhydrase 2
Ligand
BDBM50190147
Substrate
Meas. Tech.
ChEBML_1591367
Ki
6.5±n/a nM
Citation
 Bozdag, MAlafeefy, AMCarta, FCeruso, MAl-Tamimi, ASAl-Kahtani, AAAlasmary, FASSupuran, CT Synthesis 4-[2-(2-mercapto-4-oxo-4H-quinazolin-3-yl)-ethyl]-benzenesulfonamides with subnanomolar carbonic anhydrase II and XII inhibitory properties. Bioorg Med Chem 24:4100-4107 (2016)  
Target
Name:
Carbonic anhydrase 2
Synonyms:
CA-II CAC Carbonate dehydratase II Carbonic anhydrase 2 (CA-II) Carbonic anhydrase C Carbonic anhydrase II (CA-II) Carbonic anhydrase II (hCA II) | Carbonic anhydrase isoenzyme II (hCA II)
Type:
Enzyme
Mol. Mass.:
29250.71
Organism:
Homo sapiens (Human)
Description:
P00918
Residue:
260
  
Inhibitor
Name:
BDBM50190147
Synonyms:
CHEMBL3828207
Type:
Small organic molecule
Emp. Form.:
C16H14ClN3O3S2
Mol. Mass.:
395.884
SMILES:
NS(=O)(=O)c1ccc(CCn2c(S)nc3ccc(Cl)cc3c2=O)cc1
: