Target
Carbonic anhydrase 2
Ligand
BDBM50190137
Substrate
Meas. Tech.
ChEMBL_1591367 (CHEMBL3830276)
Ki
11±n/a nM
Citation
 Bozdag, MAlafeefy, AMCarta, FCeruso, MAl-Tamimi, ASAl-Kahtani, AAAlasmary, FASSupuran, CT Synthesis 4-[2-(2-mercapto-4-oxo-4H-quinazolin-3-yl)-ethyl]-benzenesulfonamides with subnanomolar carbonic anhydrase II and XII inhibitory properties. Bioorg Med Chem 24:4100-4107 (2016)  
Target
Name:
Carbonic anhydrase 2
Synonyms:
CA-II CAC Carbonate dehydratase II Carbonic anhydrase 2 (CA-II) Carbonic anhydrase C Carbonic anhydrase II (CA-II) Carbonic anhydrase II (hCA II) | Carbonic anhydrase isoenzyme II (hCA II)
Type:
Enzyme
Mol. Mass.:
29250.71
Organism:
Homo sapiens (Human)
Description:
P00918
Residue:
260
  
Inhibitor
Name:
BDBM50190137
Synonyms:
CHEMBL3827090
Type:
Small organic molecule
Emp. Form.:
C19H21N3O6S2
Mol. Mass.:
451.517
SMILES:
COc1cc2c(nc(S)n(CCc3ccc(cc3)S(N)(=O)=O)c2=O)c(OC)c1OC
: