Target
Carbonic anhydrase 1
Ligand
BDBM50190142
Substrate
Meas. Tech.
ChEMBL_1591366 (CHEMBL3830275)
Ki
29±n/a nM
Citation
 Bozdag, MAlafeefy, AMCarta, FCeruso, MAl-Tamimi, ASAl-Kahtani, AAAlasmary, FASSupuran, CT Synthesis 4-[2-(2-mercapto-4-oxo-4H-quinazolin-3-yl)-ethyl]-benzenesulfonamides with subnanomolar carbonic anhydrase II and XII inhibitory properties. Bioorg Med Chem 24:4100-4107 (2016)  
Target
Name:
Carbonic anhydrase 1
Synonyms:
CA-I CAB Carbonate dehydratase I Carbonic anhydrase 1 (CA I) Carbonic anhydrase 1 (Recombinant CA I) Carbonic anhydrase B Carbonic anhydrase I (CA I) Carbonic anhydrase I (CAI) Carbonic anhydrase isoenzyme I (hCA I) | hCA
Type:
Enzyme
Mol. Mass.:
28873.37
Organism:
Homo sapiens (Human)
Description:
P00915
Residue:
261
  
Inhibitor
Name:
BDBM50190142
Synonyms:
CHEMBL3828241
Type:
Small organic molecule
Emp. Form.:
C17H17N3O4S2
Mol. Mass.:
391.465
SMILES:
COc1ccc2c(c1)nc(S)n(CCc1ccc(cc1)S(N)(=O)=O)c2=O
: