Target
Carbonic anhydrase 12
Ligand
BDBM50190137
Substrate
Meas. Tech.
ChEMBL_1591368 (CHEMBL3830277)
Ki
7.1±n/a nM
Citation
 Bozdag, MAlafeefy, AMCarta, FCeruso, MAl-Tamimi, ASAl-Kahtani, AAAlasmary, FASSupuran, CT Synthesis 4-[2-(2-mercapto-4-oxo-4H-quinazolin-3-yl)-ethyl]-benzenesulfonamides with subnanomolar carbonic anhydrase II and XII inhibitory properties. Bioorg Med Chem 24:4100-4107 (2016)  
Target
Name:
Carbonic anhydrase 12
Synonyms:
CA-XII CAH12_HUMAN Carbonic anhydrase Carbonic anhydrase XII Carbonic anhydrase XII (CAXII) | Tumor antigen HOM-RCC-3.1.3
Type:
Enzyme
Mol. Mass.:
39456.00
Organism:
Homo sapiens (Human)
Description:
Catalytic domain of human cloned isozyme was used in the assay
Residue:
354
  
Inhibitor
Name:
BDBM50190137
Synonyms:
CHEMBL3827090
Type:
Small organic molecule
Emp. Form.:
C19H21N3O6S2
Mol. Mass.:
451.517
SMILES:
COc1cc2c(nc(S)n(CCc3ccc(cc3)S(N)(=O)=O)c2=O)c(OC)c1OC
: