Target
Carbonic anhydrase 12
Ligand
BDBM50190142
Substrate
Meas. Tech.
ChEMBL_1591368 (CHEMBL3830277)
Ki
0.470000±n/a nM
Citation
 Bozdag, MAlafeefy, AMCarta, FCeruso, MAl-Tamimi, ASAl-Kahtani, AAAlasmary, FASSupuran, CT Synthesis 4-[2-(2-mercapto-4-oxo-4H-quinazolin-3-yl)-ethyl]-benzenesulfonamides with subnanomolar carbonic anhydrase II and XII inhibitory properties. Bioorg Med Chem 24:4100-4107 (2016)  
Target
Name:
Carbonic anhydrase 12
Synonyms:
CA-XII CAH12_HUMAN Carbonic anhydrase Carbonic anhydrase XII Carbonic anhydrase XII (CAXII) | Tumor antigen HOM-RCC-3.1.3
Type:
Enzyme
Mol. Mass.:
39456.00
Organism:
Homo sapiens (Human)
Description:
Catalytic domain of human cloned isozyme was used in the assay
Residue:
354
  
Inhibitor
Name:
BDBM50190142
Synonyms:
CHEMBL3828241
Type:
Small organic molecule
Emp. Form.:
C17H17N3O4S2
Mol. Mass.:
391.465
SMILES:
COc1ccc2c(c1)nc(S)n(CCc1ccc(cc1)S(N)(=O)=O)c2=O
: