Target
Carbonic anhydrase 2
Ligand
BDBM50190143
Substrate
Meas. Tech.
ChEMBL_1591367 (CHEMBL3830276)
Ki
1±n/a nM
Citation
 Bozdag, MAlafeefy, AMCarta, FCeruso, MAl-Tamimi, ASAl-Kahtani, AAAlasmary, FASSupuran, CT Synthesis 4-[2-(2-mercapto-4-oxo-4H-quinazolin-3-yl)-ethyl]-benzenesulfonamides with subnanomolar carbonic anhydrase II and XII inhibitory properties. Bioorg Med Chem 24:4100-4107 (2016)  
Target
Name:
Carbonic anhydrase 2
Synonyms:
CA-II CAC Carbonate dehydratase II Carbonic anhydrase 2 (CA-II) Carbonic anhydrase C Carbonic anhydrase II (CA-II) Carbonic anhydrase II (hCA II) | Carbonic anhydrase isoenzyme II (hCA II)
Type:
Enzyme
Mol. Mass.:
29250.71
Organism:
Homo sapiens (Human)
Description:
P00918
Residue:
260
  
Inhibitor
Name:
BDBM50190143
Synonyms:
CHEMBL3827651
Type:
Small organic molecule
Emp. Form.:
C17H17N3O4S2
Mol. Mass.:
391.465
SMILES:
COc1ccc2nc(S)n(CCc3ccc(cc3)S(N)(=O)=O)c(=O)c2c1
: