Target
Carbonic anhydrase 1
Ligand
BDBM50197810
Substrate
Meas. Tech.
ChEMBL_1619736 (CHEMBL3861905)
Ki
93±n/a nM
Citation
 Nocentini, AFerraroni, MCarta, FCeruso, MGratteri, PLanzi, CMasini, ESupuran, CT Benzenesulfonamides Incorporating Flexible Triazole Moieties Are Highly Effective Carbonic Anhydrase Inhibitors: Synthesis and Kinetic, Crystallographic, Computational, and Intraocular Pressure Lowering Investigations. J Med Chem 59:10692-10704 (2016)  
Target
Name:
Carbonic anhydrase 1
Synonyms:
CA-I CAB Carbonate dehydratase I Carbonic anhydrase 1 (CA I) Carbonic anhydrase 1 (Recombinant CA I) Carbonic anhydrase B Carbonic anhydrase I (CA I) Carbonic anhydrase I (CAI) Carbonic anhydrase isoenzyme I (hCA I) | hCA
Type:
Enzyme
Mol. Mass.:
28873.37
Organism:
Homo sapiens (Human)
Description:
P00915
Residue:
261
  
Inhibitor
Name:
BDBM50197810
Synonyms:
CHEMBL3899660
Type:
Small organic molecule
Emp. Form.:
C15H14N4O4S
Mol. Mass.:
346.361
SMILES:
NS(=O)(=O)c1ccc(OCc2cn(nn2)-c2ccc(O)cc2)cc1
: