Target
Histamine H4 receptor
Ligand
BDBM50198912
Substrate
Meas. Tech.
ChEMBL_1621011 (CHEMBL3863294)
Ki
11000±n/a nM
Citation
 Labeeuw, OLevoin, NBillot, XDanvy, DCalmels, TKrief, SLigneau, XBerrebi-Bertrand, IRobert, PLecomte, JMSchwartz, JCCapet, M Synthesis and evaluation of a 2-benzothiazolylphenylmethyl ether class of histamine H4 receptor antagonists. Bioorg Med Chem Lett 26:5263-5266 (2016)  
Target
Name:
Histamine H4 receptor
Synonyms:
AXOR35 GPCR105 HH4R HRH4 Histamine H4 receptor Histamine receptor (H3 and H4) SP9144
Type:
G Protein-Coupled Receptor (GPCR)
Mol. Mass.:
44517.02
Organism:
Homo sapiens (Human)
Description:
Binding assays were using CHO cells stably expressing hH4R receptors.
Residue:
390
  
Inhibitor
Name:
BDBM50198912
Synonyms:
CHEBI:29009 | N-Methylhistamine
Type:
Small organic molecule
Emp. Form.:
C6H11N3
Mol. Mass.:
125.1716
SMILES:
Cn1cnc(CCN)c1
: