Target
Outer membrane protein MIP
Ligand
BDBM50200297
Substrate
Meas. Tech.
ChEMBL_1622004 (CHEMBL3864356)
IC50
5700±n/a nM
Citation
 Seufert, FKuhn, MHein, MWeiwad, MVivoli, MNorville, IHSarkar-Tyson, MMarshall, LESchweimer, KBruhn, HRösch, PHarmer, NJSotriffer, CAHolzgrabe, U Development, synthesis and structure-activity-relationships of inhibitors of the macrophage infectivity potentiator (Mip) proteins of Legionella pneumophila and Burkholderia pseudomallei. Bioorg Med Chem 24:5134-5147 (2016)  
Target
Name:
Outer membrane protein MIP
Synonyms:
MIP_LEGPN PPIase Rotamase | mip
Type:
PROTEIN
Mol. Mass.:
24869.94
Organism:
Legionella pneumophila
Description:
ChEMBL_701873
Residue:
233
  
Inhibitor
Name:
BDBM50200297
Synonyms:
CHEMBL3939283
Type:
Small organic molecule
Emp. Form.:
C21H25FN2O4S
Mol. Mass.:
420.498
SMILES:
Fc1ccc(CS(=O)(=O)N2CCCC[C@H]2C(=O)OCCCc2cccnc2)cc1
: