Target
Kinesin-like protein KIF11
Ligand
BDBM50204214
Substrate
Meas. Tech.
ChEMBL_1626934 (CHEMBL3869455)
IC50
6800±n/a nM
Citation
 Sawada, JIOsawa, ATakeuchi, TKaneda, MOishi, SFujii, NAsai, ATanino, KNamba, K Functional 1,3a,6a-triazapentalene scaffold: Design of fluorescent probes for kinesin spindle protein (KSP). Bioorg Med Chem Lett 26:5765-5769 (2016)  
Target
Name:
Kinesin-like protein KIF11
Synonyms:
EG5 KIF11_HUMAN Kinesin Spindle Protein Eg5 TRIP5 | kinesin spindle protein
Type:
PROTEIN
Mol. Mass.:
119138.97
Organism:
Homo sapiens (Human)
Description:
ChEMBL_1457426
Residue:
1056
  
Inhibitor
Name:
BDBM50204214
Synonyms:
CHEMBL3895911
Type:
Small organic molecule
Emp. Form.:
C18H12F3N3
Mol. Mass.:
327.3032
SMILES:
FC(F)(F)c1ccc(cc1)-c1ccc(cc1)-c1cn2ccc[n+]2[n-]1
: