Target
Dual specificity tyrosine-phosphorylation-regulated kinase 1A
Ligand
BDBM50204659
Substrate
Meas. Tech.
ChEMBL_1627841 (CHEMBL3870426)
IC50
6000±n/a nM
Citation
 Lawson, MRodrigo, JBaratte, BRobert, TDelehouzé, CLozach, ORuchaud, SBach, SBrion, JDAlami, MHamze, A Synthesis, biological evaluation and molecular modeling studies of imidazo[1,2-a]pyridines derivatives as protein kinase inhibitors. Eur J Med Chem 123:105-114 (2016)  
Target
Name:
Dual specificity tyrosine-phosphorylation-regulated kinase 1A
Synonyms:
DYR1A_HUMAN DYRK1A Dual specificity YAK1-related kinase 1A (Dyrk1A) Dual-specificity tyrosine-phosphorylation regulated kinase 1A HP86 MNBH
Type:
Enzyme
Mol. Mass.:
85616.61
Organism:
Homo sapiens (Human)
Description:
Q13627
Residue:
763
  
Inhibitor
Name:
BDBM50204659
Synonyms:
CHEMBL3923825
Type:
Small organic molecule
Emp. Form.:
C13H10N4O2
Mol. Mass.:
254.2441
SMILES:
NC(=O)c1cc(ccc1O)-c1cn2ccncc2n1
: