Target
Dual specificity protein kinase CLK1
Ligand
BDBM50208630
Substrate
Meas. Tech.
ChEMBL_1633065 (CHEMBL3875857)
IC50
1500±n/a nM
Citation
 Labrière, CLozach, OBlairvacq, MMeijer, LGuillou, C Further investigation of Paprotrain: Towards the conception of selective and multi-targeted CNS kinase inhibitors. Eur J Med Chem 124:920-934 (2016)  
Target
Name:
Dual specificity protein kinase CLK1
Synonyms:
CDC-like kinase 1 CDC2-like kinase 1 (CLK1) CLK1 Dual specificity protein kinase CLK1 Dual specificty protein kinase CLK1
Type:
Protein
Mol. Mass.:
57322.21
Organism:
Homo sapiens (Human)
Description:
P49759
Residue:
484
  
Inhibitor
Name:
BDBM50208630
Synonyms:
CHEMBL3751934
Type:
Small organic molecule
Emp. Form.:
C17H13N3O
Mol. Mass.:
275.3046
SMILES:
COc1cccc2c(c[nH]c12)C(=C\c1cccnc1)\C#N
: