Target
Dual specificity tyrosine-phosphorylation-regulated kinase 1A
Ligand
BDBM50208630
Substrate
Meas. Tech.
ChEMBL_1633064 (CHEMBL3875856)
IC50
1200±n/a nM
Citation
 Labrière, CLozach, OBlairvacq, MMeijer, LGuillou, C Further investigation of Paprotrain: Towards the conception of selective and multi-targeted CNS kinase inhibitors. Eur J Med Chem 124:920-934 (2016)  
Target
Name:
Dual specificity tyrosine-phosphorylation-regulated kinase 1A
Synonyms:
DYR1A_HUMAN DYRK1A Dual specificity YAK1-related kinase 1A (Dyrk1A) Dual-specificity tyrosine-phosphorylation regulated kinase 1A HP86 MNBH
Type:
Enzyme
Mol. Mass.:
85616.61
Organism:
Homo sapiens (Human)
Description:
Q13627
Residue:
763
  
Inhibitor
Name:
BDBM50208630
Synonyms:
CHEMBL3751934
Type:
Small organic molecule
Emp. Form.:
C17H13N3O
Mol. Mass.:
275.3046
SMILES:
COc1cccc2c(c[nH]c12)C(=C\c1cccnc1)\C#N
: