Target
Carbonic anhydrase 7
Ligand
BDBM50209282
Substrate
Meas. Tech.
ChEMBL_1633810 (CHEMBL3876602)
Ki
0.700000±n/a nM
Citation
 Angapelly, SRamya, PVAngeli, AMonti, SMBuonanno, MAlvala, MSupuran, CTArifuddin, M Discovery of 4-sulfamoyl-phenyl-ß-lactams as a new class of potent carbonic anhydrase isoforms I, II, IV and VII inhibitors: The first example of subnanomolar CA IV inhibitors. Bioorg Med Chem 25:539-544 (2017)  
Target
Name:
Carbonic anhydrase 7
Synonyms:
CA-VII CAH7_HUMAN Carbonic anhydrase Carbonic anhydrase VII (CA VII)
Type:
Enzyme
Mol. Mass.:
29664.11
Organism:
Homo sapiens (Human)
Description:
Human cloned isozyme.
Residue:
264
  
Inhibitor
Name:
BDBM50209282
Synonyms:
CHEMBL3883491
Type:
Small organic molecule
Emp. Form.:
C24H24N2O6S
Mol. Mass.:
468.522
SMILES:
COc1cc(OC)c(cc1OC)[C@H]1[C@@H](C(=O)N1c1ccc(cc1)S(N)(=O)=O)c1ccccc1
: