Target
Histone deacetylase 8
Ligand
BDBM50209794
Substrate
Meas. Tech.
ChEMBL_1634162 (CHEMBL3876954)
IC50
345±n/a nM
Citation
 Raji, IYadudu, FJaneira, EFathi, SSzymczak, LKornacki, JRKomatsu, KLi, JDMrksich, MOyelere, AK Bifunctional conjugates with potent inhibitory activity towards cyclooxygenase and histone deacetylase. Bioorg Med Chem 25:1202-1218 (2017)  
Target
Name:
Histone deacetylase 8
Synonyms:
HD8 HDAC8_HUMAN Histone deacetylase 8 (HDAC-8) | Human HDAC8
Type:
Enzyme
Mol. Mass.:
41749.60
Organism:
Homo sapiens (Human)
Description:
Q9BY41
Residue:
377
  
Inhibitor
Name:
BDBM50209794
Synonyms:
CHEMBL3884118
Type:
Small organic molecule
Emp. Form.:
C25H28ClN3O5
Mol. Mass.:
485.96
SMILES:
COc1ccc2n(C(=O)c3ccc(Cl)cc3)c(C)c(CC(=O)NCCCCCC(=O)NO)c2c1
: