Target
Quinolone resistance protein NorA
Ligand
BDBM50153282
Substrate
Meas. Tech.
ChEMBL_1636257 (CHEMBL3879155)
IC50
12500±n/a nM
Citation
 Buonerba, FLepri, SGoracci, LSchindler, BDSeo, SMKaatz, GWCruciani, G Improved Potency of Indole-Based NorA Efflux Pump Inhibitors: From Serendipity toward Rational Design and Development. J Med Chem 60:517-523 (2017)  
Target
Name:
Quinolone resistance protein NorA
Synonyms:
NORA_STAAU | norA
Type:
PROTEIN
Mol. Mass.:
42273.03
Organism:
Staphylococcus aureus
Description:
ChEMBL_961221
Residue:
388
  
Inhibitor
Name:
BDBM50153282
Synonyms:
CHEMBL3775841
Type:
Small organic molecule
Emp. Form.:
C22H26N2O3
Mol. Mass.:
366.4534
SMILES:
CCOC(=O)c1c(C)n(Cc2ccccc2)c2ccc(OCCCN)cc12
: