Target
Endoplasmic reticulum aminopeptidase 2
Ligand
BDBM50076744
Substrate
Meas. Tech.
ChEMBL_1636857 (CHEMBL3879755)
IC50
50±n/a nM
Citation
 Mpakali, AGiastas, PDeprez-Poulain, RPapakyriakou, AKoumantou, DGealageas, RTsoukalidou, SVourloumis, DMavridis, IMStratikos, ESaridakis, E Crystal Structures of ERAP2 Complexed with Inhibitors Reveal Pharmacophore Requirements for Optimizing Inhibitor Potency. ACS Med Chem Lett 8:333-337 (2017)  
Target
Name:
Endoplasmic reticulum aminopeptidase 2
Synonyms:
Aminopeptidase ERAP2_HUMAN | LRAP
Type:
PROTEIN
Mol. Mass.:
110463.90
Organism:
Homo sapiens (Human)
Description:
ChEMBL_1473169
Residue:
960
  
Inhibitor
Name:
BDBM50076744
Synonyms:
CHEMBL3416733
Type:
Small organic molecule
Emp. Form.:
C27H37N4O4P
Mol. Mass.:
512.5808
SMILES:
CC(C)C[C@H](CP(O)(=O)[C@@H](N)CCc1ccccc1)C(=O)N[C@@H](Cc1c[nH]c2ccccc12)C(N)=O
: