Target
Cysteinyl leukotriene receptor 1/2
Ligand
BDBM50215871
Substrate
Meas. Tech.
ChEBML_98640
Ki
19±n/a nM
Citation
 Chambers, RJAntognoli, GWCheng, JBMarfat, APillar, JSShirley, JTWatson, JW Development of new chromanol antagonists of leukotriene D4. Bioorg Med Chem Lett 8:1791-6 (1998)  
Target
Name:
Cysteinyl leukotriene receptor 1/2
Synonyms:
Cysteinyl leukotriene receptor
Type:
Mol. Mass.:
Description:
ASSAY_ID of ChEMBL is 98640
Components:
This complex has 2 components.
Component 1
Name:
Cysteinyl leukotriene receptor 1
Synonyms:
CLTR1_HUMAN CYSLTR1 Cysteinyl leukotriene receptor HG55 LTD4 receptor | Leukotriene Cysteinyl 1
Type:
Enzyme Catalytic Domain
Mol. Mass.:
38565.16
Organism:
Homo sapiens (Human)
Description:
Leukotriene Cysteinyl 1 CYSLTR1 HUMAN::Q9Y271
Residue:
337
  
Component 2
Name:
Cysteinyl leukotriene receptor 2
Synonyms:
CLTR2_HUMAN CYSLT2R Cysteinyl leukotriene receptor Leukotriene Cysteinyl 2
Type:
Enzyme Catalytic Domain
Mol. Mass.:
39657.52
Organism:
Homo sapiens (Human)
Description:
Leukotriene Cysteinyl 2 CYSLTR2 HUMAN::Q9NS75
Residue:
346
  
Inhibitor
Name:
BDBM50215871
Synonyms:
CHEMBL415954
Type:
Small organic molecule
Emp. Form.:
C26H22F4N2O5S2
Mol. Mass.:
582.587
SMILES:
C[C@@H]1Oc2ccc(OCc3nc4cc(F)ccc4s3)cc2[C@@H](O)[C@H]1Cc1cccc(NS(=O)(=O)C(F)(F)F)c1
: