Target
cAMP-specific 3',5'-cyclic phosphodiesterase 4A/4B/4C/4D
Ligand
BDBM50215950
Substrate
Meas. Tech.
ChEMBL_155717 (CHEMBL760595)
Ki
7±n/a nM
Citation
 Hulme, CMoriarty, KMiller, BMathew, RRamanjulu, MCox, PSouness, JPage, KMUhl, JTravis, JHuang, FCLabaudiniere, RDjuric, SW The synthesis and biological evaluation of a novel series of indole PDE4 inhibitors I. Bioorg Med Chem Lett 8:1867-72 (1998)  
Target
Name:
cAMP-specific 3',5'-cyclic phosphodiesterase 4A/4B/4C/4D
Synonyms:
Phosphodiesterase 4
Type:
Mol. Mass.:
Description:
ASSAY_ID of ChEMBL is 788178
Components:
This complex has 4 components.
Component 1
Name:
cAMP-specific 3',5'-cyclic phosphodiesterase 4A
Synonyms:
3',5'-cyclic phosphodiesterase PDE46 PDE4A_HUMAN Phosphodiesterase 4A | Phosphodiesterase 4A (PDE4)
Type:
Enzyme
Mol. Mass.:
98113.27
Organism:
Homo sapiens (Human)
Description:
P27815
Residue:
886
  
Component 2
Name:
cAMP-specific 3',5'-cyclic phosphodiesterase 4D
Synonyms:
3',5'-cyclic phosphodiesterase PDE43 PDE4D_HUMAN | Phosphodiesterase 4D
Type:
Protein
Mol. Mass.:
91092.69
Organism:
Homo sapiens (Human)
Description:
Q08499
Residue:
809
  
Component 3
Name:
cAMP-specific 3',5'-cyclic phosphodiesterase 4B
Synonyms:
3',5'-cyclic phosphodiesterase Isoform PDE4B1 PDE4B PDE4B_HUMAN Phosphodiesterase 4B (PDE4B) Phosphodiesterase Type 4 (PDE4B)
Type:
Protein
Mol. Mass.:
83318.87
Organism:
Homo sapiens (Human)
Description:
Q07343
Residue:
736
  
Component 4
Name:
cAMP-specific 3',5'-cyclic phosphodiesterase 4C
Synonyms:
3',5'-cyclic phosphodiesterase NP_000914.2 PDE4C | PDE4C1
Type:
Enzyme Catalytic Domain
Mol. Mass.:
79875.54
Organism:
Homo sapiens (Human)
Description:
Q08493
Residue:
712
  
Inhibitor
Name:
BDBM50215950
Synonyms:
CHEMBL55046
Type:
Small organic molecule
Emp. Form.:
C26H19Cl2N3O
Mol. Mass.:
460.355
SMILES:
Cc1cn(Cc2ccc3ccccc3c2)c2cc(ccc12)C(=O)Nc1c(Cl)cncc1Cl
: