Target
5-hydroxytryptamine receptor 2C
Ligand
BDBM50218748
Substrate
Meas. Tech.
ChEMBL_2765 (CHEMBL617762)
Ki
50±n/a nM
Citation
 Porter, RAChan, WNCoulton, SJohns, AHadley, MSWiddowson, KJerman, JCBrough, SJColdwell, MSmart, DJewitt, FJeffrey, PAustin, N 1,3-Biarylureas as selective non-peptide antagonists of the orexin-1 receptor. Bioorg Med Chem Lett 11:1907-10 (2001)  
Target
Name:
5-hydroxytryptamine receptor 2C
Synonyms:
5-HT-1C 5-HT1C 5-HT2C-INI 5-HTR2C 5-hydroxytryptamine receptor 2C (5-HT-2C) 5HT-1C HTR1C Serotonin (5-HT3) receptor Serotonin Receptor 2C
Type:
G Protein-Coupled Receptor (GPCR)
Mol. Mass.:
51836.79
Organism:
Homo sapiens (Human)
Description:
P28335
Residue:
458
  
Inhibitor
Name:
BDBM50218748
Synonyms:
CHEMBL301209
Type:
Small organic molecule
Emp. Form.:
C19H18N4O
Mol. Mass.:
318.3724
SMILES:
CN1CCc2cc(NC(=O)Nc3ccnc4ccccc34)ccc12
: