Target
5-hydroxytryptamine receptor 2B
Ligand
BDBM50218751
Substrate
Meas. Tech.
ChEMBL_2890 (CHEMBL617608)
Ki
4.0±n/a nM
Citation
 Porter, RAChan, WNCoulton, SJohns, AHadley, MSWiddowson, KJerman, JCBrough, SJColdwell, MSmart, DJewitt, FJeffrey, PAustin, N 1,3-Biarylureas as selective non-peptide antagonists of the orexin-1 receptor. Bioorg Med Chem Lett 11:1907-10 (2001)  
Target
Name:
5-hydroxytryptamine receptor 2B
Synonyms:
5-HT-2B 5-hydroxytryptamine (serotonin) receptor 2B [Homo sapiens] 5-hydroxytryptamine receptor 2C (5HT2C) HTR2B Serotonin 2b (5-HT2b) receptor | Serotonin Receptor 2B
Type:
G Protein-Coupled Receptor (GPCR)
Mol. Mass.:
54312.47
Organism:
Homo sapiens (Human)
Description:
Receptor binding assays were performed using human clone stably expressed in CHO cells.
Residue:
481
  
Inhibitor
Name:
BDBM50218751
Synonyms:
CHEMBL300835
Type:
Small organic molecule
Emp. Form.:
C20H18N4O
Mol. Mass.:
330.3831
SMILES:
Cc1cc2cc(NC(=O)Nc3ccnc4ccccc34)ccc2n1C
: