Target
5-hydroxytryptamine receptor 2C
Ligand
BDBM50218752
Substrate
Meas. Tech.
ChEMBL_2765 (CHEMBL617762)
Ki
50±n/a nM
Citation
 Porter, RAChan, WNCoulton, SJohns, AHadley, MSWiddowson, KJerman, JCBrough, SJColdwell, MSmart, DJewitt, FJeffrey, PAustin, N 1,3-Biarylureas as selective non-peptide antagonists of the orexin-1 receptor. Bioorg Med Chem Lett 11:1907-10 (2001)  
Target
Name:
5-hydroxytryptamine receptor 2C
Synonyms:
5-HT-1C 5-HT1C 5-HT2C-INI 5-HTR2C 5-hydroxytryptamine receptor 2C (5-HT-2C) 5HT-1C HTR1C Serotonin (5-HT3) receptor Serotonin Receptor 2C
Type:
G Protein-Coupled Receptor (GPCR)
Mol. Mass.:
51836.79
Organism:
Homo sapiens (Human)
Description:
P28335
Residue:
458
  
Inhibitor
Name:
BDBM50218752
Synonyms:
CHEMBL56557
Type:
Small organic molecule
Emp. Form.:
C17H14ClN3O2
Mol. Mass.:
327.765
SMILES:
COc1ccc(NC(=O)Nc2ccnc3ccccc23)cc1Cl
: