Target
Muscarinic acetylcholine receptor M4
Ligand
BDBM81901
Substrate
Meas. Tech.
ChEMBL_139240 (CHEMBL746455)
Ki
10.0±n/a nM
Citation
 Böhme, TMKeim, CDannhardt, GMutschler, ELambrecht, G Design and pharmacology of quinuclidine derivatives as M2-selective muscarinic receptor ligands. Bioorg Med Chem Lett 11:1241-3 (2001)  
Target
Name:
Muscarinic acetylcholine receptor M4
Synonyms:
ACM4_HUMAN Cholinergic, muscarinic M4 Muscarinic acetylcholine receptor M2 and M4
Type:
Enzyme Catalytic Domain
Mol. Mass.:
53079.31
Organism:
Homo sapiens (Human)
Description:
Cholinergic, muscarinic M4 CHRM4 HUMAN M3::P08173
Residue:
479
  
Inhibitor
Name:
BDBM81901
Synonyms:
AF-DX 384 CHEMBL279453 | NSC_119356
Type:
Small organic molecule
Emp. Form.:
C27H38N6O2
Mol. Mass.:
478.6296
SMILES:
CCCN(CCC)CC1CCCCN1CCNC(=O)N1c2ccccc2C(=O)Nc2cccnc12
: