Target
D(1A)/D(2) dopamine receptor
Ligand
BDBM50225476
Substrate
Meas. Tech.
ChEMBL_59585 (CHEMBL672936)
IC50
60±n/a nM
Citation
 Nordmann, RPetcher, TJ Octahydrobenzo[g]quinolines: potent dopamine agonists which show the relationship between ergolines and apomorphine. J Med Chem 28:367-75 (1985)  
Target
Name:
D(1A)/D(2) dopamine receptor
Synonyms:
Dopamine receptor
Type:
Mol. Mass.:
Description:
ASSAY_ID of ChEMBL is 59578
Components:
This complex has 2 components.
Component 1
Name:
D(2) dopamine receptor
Synonyms:
DOPAMINE D2 DRD2_BOVIN | Dopamine D2 receptor
Type:
Enzyme Catalytic Domain
Mol. Mass.:
50698.79
Organism:
BOVINE
Description:
P20288
Residue:
444
  
Component 2
Name:
D(1A) dopamine receptor
Synonyms:
D(1A) dopamine receptor DOPAMINE D1 DRD1_BOVIN | Dopamine receptor
Type:
Enzyme Catalytic Domain
Mol. Mass.:
49330.65
Organism:
BOVINE
Description:
DOPAMINE D1 DRD1 BOVINE::Q95136
Residue:
446
  
Inhibitor
Name:
BDBM50225476
Synonyms:
CHEMBL330849
Type:
Small organic molecule
Emp. Form.:
C18H27NOS
Mol. Mass.:
305.478
SMILES:
[H][C@]12C[C@H](CSC)CN(CCC)[C@]1([H])Cc1cccc(O)c1C2
: