Target
Cannabinoid receptor 1/2
Ligand
BDBM50229939
Substrate
Meas. Tech.
ChEMBL_46144 (CHEMBL660017)
IC50
0.460000±n/a nM
Citation
 D'Ambra, TEEstep, KGBell, MREissenstat, MAJosef, KAWard, SJHaycock, DABaizman, ERCasiano, FMBeglin, NC Conformationally restrained analogues of pravadoline: nanomolar potent, enantioselective, (aminoalkyl)indole agonists of the cannabinoid receptor. J Med Chem 35:124-35 (1992)  
Target
Name:
Cannabinoid receptor 1/2
Synonyms:
Cannabinoid receptor
Type:
Mol. Mass.:
Description:
ASSAY_ID of ChEMBL is 1859866
Components:
This complex has 2 components.
Component 1
Name:
Cannabinoid receptor 2
Synonyms:
CANNABINOID CB2 CB2 Cannabinoid CB2 receptor Cnr2 | rCB2
Type:
Enzyme
Mol. Mass.:
39366.68
Organism:
Rattus norvegicus (Rat)
Description:
Q9QZN9
Residue:
360
  
Component 2
Name:
Cannabinoid receptor 1
Synonyms:
Brain-type cannabinoid receptor CB-R CNR1_RAT Cannabinoid receptor Cnr1 | Skr6
Type:
G Protein-Coupled Receptor (GPCR)
Mol. Mass.:
52856.55
Organism:
Rattus norvegicus (rat)
Description:
P20272
Residue:
473
  
Inhibitor
Name:
BDBM50229939
Synonyms:
CHEMBL423481
Type:
Small organic molecule
Emp. Form.:
C25H33NO3
Mol. Mass.:
395.5344
SMILES:
[H][C@@](C)(CCCc1ccccc1)Oc1cc(O)c2c(N[C@@H](C)[C@]3([H])CC[C@@H](O)C[C@@]23[H])c1
: