Target
Histone deacetylase 1
Ligand
BDBM50232357
Substrate
Meas. Tech.
ChEMBL_1646418 (CHEMBL3995474)
IC50
1930±n/a nM
Citation
 Nepali, KLee, HYLai, MJOjha, RWu, TYWu, GXChen, MCLiou, JP Ring-opened tetrahydro-¿-carbolines display cytotoxicity and selectivity with histone deacetylase isoforms. Eur J Med Chem 127:115-127 (2017)  
Target
Name:
Histone deacetylase 1
Synonyms:
Cereblon/Histone deacetylase 1 HDAC1 Histone deacetylase 1 (HDAC1) RPD3L1
Type:
Enzyme
Mol. Mass.:
55090.27
Organism:
Homo sapiens (Human)
Description:
Q13547
Residue:
482
  
Inhibitor
Name:
BDBM50232357
Synonyms:
CHEMBL4077893
Type:
Small organic molecule
Emp. Form.:
C20H21N3O4S
Mol. Mass.:
399.463
SMILES:
CN(C)Cc1cn(c2ccccc12)S(=O)(=O)c1ccc(\C=C\C(=O)NO)cc1
: