Target
Neuronal acetylcholine receptor subunit alpha-7
Ligand
BDBM50232605
Substrate
Meas. Tech.
ChEBML_1648183
EC50
33±n/a nM
Citation
 Iwuagwu, CKing, DMcDonald, IMCook, JZusi, FCHill, MDMate, RAFang, HKnox, RGallagher, LPost-Munson Amy Easton, DMiller, RBenitex, YSiuciak, JLodge, NZaczek, RMorgan, DBristow, LMacor, JEOlson, RE Design and synthesis of a novel series of 4-heteroarylamino-1'-azaspiro[oxazole-5,3'-bicyclo[2.2.2]octanes asa7 nicotinic receptor agonists 2. Development of 4-heteroaryl SAR. Bioorg Med Chem Lett 27:1261-1266 (2017)  
Target
Name:
Neuronal acetylcholine receptor subunit alpha-7
Synonyms:
ACHA7_RAT Cholinergic, Nicotinic Alpha7 Chrna7 Neuronal acetylcholine receptor (alpha7 nAChR) Neuronal acetylcholine receptor subunit alpha-7 Neuronal acetylcholine receptor subunit alpha-7 (nAChR)
Type:
Enzyme
Mol. Mass.:
56502.44
Organism:
Rattus norvegicus (Rat)
Description:
Q05941
Residue:
502
  
Inhibitor
Name:
BDBM50232605
Synonyms:
CHEMBL4077222
Type:
Small organic molecule
Emp. Form.:
C13H16ClN5O
Mol. Mass.:
293.752
SMILES:
Clc1cnc(NC2=NC[C@@]3(CN4CCC3CC4)O2)cn1
: