Target
Muscarinic acetylcholine receptor M5
Ligand
BDBM50445222
Substrate
Meas. Tech.
ChEMBL_1650749 (CHEMBL3999883)
IC50
1110±n/a nM
Citation
 McGowan, KMNance, KDCho, HPBridges, TMConn, PJJones, CKLindsley, CW Continued optimization of the M Bioorg Med Chem Lett 27:1356-1359 (2017)  
Target
Name:
Muscarinic acetylcholine receptor M5
Synonyms:
ACM5_HUMAN | CHRM5
Type:
PROTEIN
Mol. Mass.:
60102.35
Organism:
Homo sapiens (Human)
Description:
ChEMBL_1517990
Residue:
532
  
Inhibitor
Name:
BDBM50445222
Synonyms:
CHEMBL3105228
Type:
Small organic molecule
Emp. Form.:
C23H15ClF2N2O2
Mol. Mass.:
424.827
SMILES:
Fc1ccc(cc1F)C(=O)N1CCN2C(=O)c3ccccc3[C@@]12c1ccc(Cl)cc1
: