Target
Neuronal acetylcholine receptor subunit alpha-7
Ligand
BDBM50232594
Substrate
Meas. Tech.
ChEMBL_1655331 (CHEMBL4004697)
EC50
0.490000±n/a nM
Citation
 King, DIwuagwu, CCook, JMcDonald, IMMate, RZusi, FCHill, MDFang, HZhao, RWang, BEaston, AEMiller, RPost-Munson, DKnox, RJGallagher, LWestphal, RMolski, TFan, JClarke, WBenitex, YLentz, KADenton, RMorgan, DZaczek, RLodge, NJBristow, LJMacor, JEOlson, RE BMS-933043, a Selectivea7 nAChR Partial Agonist for the Treatment of Cognitive Deficits Associated with Schizophrenia. ACS Med Chem Lett 8:366-371 (2017)  
Target
Name:
Neuronal acetylcholine receptor subunit alpha-7
Synonyms:
ACHA7_RAT Cholinergic, Nicotinic Alpha7 Chrna7 Neuronal acetylcholine receptor (alpha7 nAChR) Neuronal acetylcholine receptor subunit alpha-7 Neuronal acetylcholine receptor subunit alpha-7 (nAChR)
Type:
Enzyme
Mol. Mass.:
56502.44
Organism:
Rattus norvegicus (Rat)
Description:
Q05941
Residue:
502
  
Inhibitor
Name:
BDBM50232594
Synonyms:
CHEMBL4102566
Type:
Small organic molecule
Emp. Form.:
C19H21N5O
Mol. Mass.:
335.4029
SMILES:
C1N=C(Nc2cc(ncn2)-c2ccccc2)O[C@]11CN2CCC1CC2
: