Target
Nuclear receptor ROR-alpha
Ligand
BDBM50235618
Substrate
Meas. Tech.
ChEMBL_1657624 (CHEMBL4007094)
IC50
11900±n/a nM
Citation
 Nefzi, AMarconi, GDOrtiz, MADavis, JCPiedrafita, FJ Synthesis of dihydroimidazole tethered imidazolinethiones and their activity as novel antagonists of the nuclear retinoic acid receptor-related orphan receptors (RORs). Bioorg Med Chem Lett 27:1608-1610 (2017)  
Target
Name:
Nuclear receptor ROR-alpha
Synonyms:
NR1F1 Nuclear receptor subfamily 1 group F member 1 RORA RZRA | Retinoid-related orphan receptor-alpha
Type:
PROTEIN
Mol. Mass.:
58976.26
Organism:
Homo sapiens (Human)
Description:
ChEMBL_101591
Residue:
523
  
Inhibitor
Name:
BDBM50235618
Synonyms:
CHEMBL4093723
Type:
Small organic molecule
Emp. Form.:
C25H40N4S
Mol. Mass.:
428.677
SMILES:
CCCC[C@H]1CN(CCCC[C@H]2CNC(CCC)=N2)C(=S)N1CCc1ccccc1
: