Target
Nuclear receptor ROR-gamma
Ligand
BDBM50235623
Substrate
Meas. Tech.
ChEMBL_1657623 (CHEMBL4007093)
IC50
9300±n/a nM
Citation
 Nefzi, AMarconi, GDOrtiz, MADavis, JCPiedrafita, FJ Synthesis of dihydroimidazole tethered imidazolinethiones and their activity as novel antagonists of the nuclear retinoic acid receptor-related orphan receptors (RORs). Bioorg Med Chem Lett 27:1608-1610 (2017)  
Target
Name:
Nuclear receptor ROR-gamma
Synonyms:
Nr1f3 Nuclear receptor subfamily 1 group F member 3 RORG_MOUSE Rorc TOR Thymus orphan receptor
Type:
PROTEIN
Mol. Mass.:
58133.31
Organism:
Mus musculus
Description:
ChEMBL_103664
Residue:
516
  
Inhibitor
Name:
BDBM50235623
Synonyms:
CHEMBL4064439
Type:
Small organic molecule
Emp. Form.:
C29H44N4S
Mol. Mass.:
480.751
SMILES:
CCCC1=N[C@@H](CCCCN2C[C@H](Cc3ccccc3)N(CCC3CC4CCC3C4)C2=S)CN1
: