Target
Nuclear receptor ROR-alpha
Ligand
BDBM50235609
Substrate
Meas. Tech.
ChEMBL_1657624 (CHEMBL4007094)
IC50
6400±n/a nM
Citation
 Nefzi, AMarconi, GDOrtiz, MADavis, JCPiedrafita, FJ Synthesis of dihydroimidazole tethered imidazolinethiones and their activity as novel antagonists of the nuclear retinoic acid receptor-related orphan receptors (RORs). Bioorg Med Chem Lett 27:1608-1610 (2017)  
Target
Name:
Nuclear receptor ROR-alpha
Synonyms:
NR1F1 Nuclear receptor subfamily 1 group F member 1 RORA RZRA | Retinoid-related orphan receptor-alpha
Type:
PROTEIN
Mol. Mass.:
58976.26
Organism:
Homo sapiens (Human)
Description:
ChEMBL_101591
Residue:
523
  
Inhibitor
Name:
BDBM50235609
Synonyms:
CHEMBL4096280
Type:
Small organic molecule
Emp. Form.:
C32H44N4S
Mol. Mass.:
516.784
SMILES:
S=C1N(CCCC[C@H]2CNC(CC3CCCCC3)=N2)C[C@H](Cc2ccccc2)N1CCc1ccccc1
: