Target
Alpha-galactosidase
Ligand
BDBM50236278
Substrate
Meas. Tech.
ChEMBL_1658945 (CHEMBL4008557)
Ki
>100000±n/a nM
Citation
 García-Moreno, MIde la Mata, MSánchez-Fernández, EMBenito, JMDíaz-Quintana, AFustero, SNanba, EHigaki, KSánchez-Alcázar, JAGarcía Fernández, JMOrtiz Mellet, C Fluorinated Chaperone-ß-Cyclodextrin Formulations forß-Glucocerebrosidase Activity Enhancement in Neuronopathic Gaucher Disease. J Med Chem 60:1829-1842 (2017)  
Target
Name:
Alpha-galactosidase
Synonyms:
α-galactosidase Alpha-galactosidase
Type:
Protein
Mol. Mass.:
41306.82
Organism:
Coffea arabica (Coffee beans)
Description:
Residue:
378
  
Inhibitor
Name:
BDBM50236278
Synonyms:
CHEMBL4077472
Type:
Small organic molecule
Emp. Form.:
C18H24F9N3O5S
Mol. Mass.:
565.451
SMILES:
[H][C@@]12CO[C@@]([H])([C@H](O)[C@@H](O)[C@@H]1O)N2C(=S)NCCCCNC(=O)CCC(F)(F)C(F)(F)C(F)(F)C(F)(F)F
: