Target
D(2) dopamine receptor
Ligand
BDBM50164855
Substrate
Meas. Tech.
ChEMBL_1661608 (CHEMBL4011220)
IC50
158±n/a nM
Citation
 Bonifazi, AYano, HEllenberger, MPMuller, LKumar, VZou, MFCai, NSGuerrero, AMWoods, ASShi, LNewman, AH Novel Bivalent Ligands Based on the Sumanirole Pharmacophore Reveal Dopamine D J Med Chem 60:2890-2907 (2017)  
Target
Name:
D(2) dopamine receptor
Synonyms:
D(2) dopamine receptor DOPAMINE D2 Long DRD2 Dopamine D2 receptor Dopamine D2 receptor (D2R) Dopamine2-like | d2
Type:
Cell-surface receptors
Mol. Mass.:
50647.10
Organism:
Homo sapiens (Human)
Description:
P14416
Residue:
443
  
Inhibitor
Name:
BDBM50164855
Synonyms:
CHEMBL3797209
Type:
Small organic molecule
Emp. Form.:
C19H29N3O
Mol. Mass.:
315.4531
SMILES:
CCCN(CCC)[C@@H]1Cc2cccc3n(CCC)c(=O)n(C1)c23
: