Target
D(2) dopamine receptor
Ligand
BDBM50237344
Substrate
Meas. Tech.
ChEMBL_1661608 (CHEMBL4011220)
IC50
713±n/a nM
Citation
 Bonifazi, AYano, HEllenberger, MPMuller, LKumar, VZou, MFCai, NSGuerrero, AMWoods, ASShi, LNewman, AH Novel Bivalent Ligands Based on the Sumanirole Pharmacophore Reveal Dopamine D J Med Chem 60:2890-2907 (2017)  
Target
Name:
D(2) dopamine receptor
Synonyms:
D(2) dopamine receptor DOPAMINE D2 Long DRD2 Dopamine D2 receptor Dopamine D2 receptor (D2R) Dopamine2-like | d2
Type:
Cell-surface receptors
Mol. Mass.:
50647.10
Organism:
Homo sapiens (Human)
Description:
P14416
Residue:
443
  
Inhibitor
Name:
BDBM50237344
Synonyms:
CHEMBL4068455
Type:
Small organic molecule
Emp. Form.:
C29H37N5O2
Mol. Mass.:
487.6364
SMILES:
CCCN(CCC)[C@@H]1Cc2cccc3n(CCCCNC(=O)c4cc5ccccc5[nH]4)c(=O)n(C1)c23
: