Target
Adenosine receptor A3
Ligand
BDBM50037785
Substrate
Ki
47±n/a nM
Comments
PDSP_323
Citation
 Hill, RJOleynek, JJHoth, CFKiron, MAWeng, WWester, RTTracey, WRKnight, DRBuchholz, RAKennedy, SP Cloning, expression and pharmacological characterization of rabbit adenosine A1 and A3 receptors. J Pharmacol Exp Ther 280:122-8 (1997) Target
Name:
Adenosine receptor A3
Synonyms:
AA3R_RABIT ADORA3
Type:
Protein
Mol. Mass.:
36319.35
Organism:
Oryctolagus cuniculus (rabbit)
Description:
O02667
Residue:
319
  
Inhibitor
Name:
BDBM50037785
Synonyms:
2-(6-{[2-(4-aminophenyl)ethyl]amino}-9H-purin-9-yl)-5-(hydroxymethyl)oxolane-3,4-diol APNEA ChEMBL_198532
Type:
Small organic molecule
Emp. Form.:
C18H22N6O4
Mol. Mass.:
386.4051
SMILES:
Nc1ccc(CCNc2ncnc3n(cnc23)C2OC(CO)C(O)C2O)cc1
: