Target
Alpha-2A adrenergic receptor
Ligand
BDBM81926
Substrate
Ki
7.94±n/a nM
Comments
PDSP_1437
Citation
 Jasper, JRLesnick, JDChang, LKYamanishi, SSChang, TKHsu, SADaunt, DABonhaus, DWEglen, RM Ligand efficacy and potency at recombinant alpha2 adrenergic receptors: agonist-mediated [35S]GTPgammaS binding. Biochem Pharmacol 55:1035-43 (1998)  
Target
Name:
Alpha-2A adrenergic receptor
Synonyms:
ADA2A_HUMAN ADRA2R Adrenergic alpha2A Alpha-2 adrenergic receptor subtype C10 Alpha-2A adrenoreceptor alpha-2A adrenergic receptor [Homo sapiens]
Type:
Enzyme
Mol. Mass.:
48979.91
Organism:
Homo sapiens (Human)
Description:
P08913
Residue:
450
  
Inhibitor
Name:
BDBM81926
Synonyms:
Aminoclonidine, p NSC_51763 | p-AMINOCLONIDINE
Type:
Small organic molecule
Emp. Form.:
C9H10Cl2N4
Mol. Mass.:
245.109
SMILES:
Nc1cc(Cl)c(NC2=NCCN2)c(Cl)c1
: