Target
Alpha-2B adrenergic receptor
Ligand
BDBM31046
Substrate
Ki
33.11±n/a nM
Comments
PDSP_1479
Citation
 Jasper, JRLesnick, JDChang, LKYamanishi, SSChang, TKHsu, SADaunt, DABonhaus, DWEglen, RM Ligand efficacy and potency at recombinant alpha2 adrenergic receptors: agonist-mediated [35S]GTPgammaS binding. Biochem Pharmacol 55:1035-43 (1998)  
Target
Name:
Alpha-2B adrenergic receptor
Synonyms:
ADA2B_HUMAN ADRA2L1 Adrenergic alpha2B Adrenergic receptor alpha Alpha-2 adrenergic receptor subtype C2 Alpha-2B adrenoreceptor | Alpha-2BAR
Type:
Enzyme
Mol. Mass.:
49964.20
Organism:
Homo sapiens (Human)
Description:
P18089
Residue:
450
  
Inhibitor
Name:
BDBM31046
Synonyms:
3-[4,5-dihydro-1H-imidazol-2-ylmethyl-(4-methylphenyl)amino]phenol;methanesulfonic acid 3-[N-(2-imidazolin-2-ylmethyl)-4-methyl-anilino]phenol;mesylic acid MLS000069487 PHENTOLAMINE MESYLATE cid_5775 | cid_91430
Type:
Small organic molecule
Emp. Form.:
C17H19N3O
Mol. Mass.:
281.3523
SMILES:
Cc1ccc(cc1)N(CC1=NCCN1)c1cccc(O)c1
: