Target
Somatostatin receptor type 2
Ligand
BDBM85671
Substrate
Ki
2.63±n/a nM
Comments
PDSP_7209
Citation
 Feniuk, WJarvie, ELuo, JHumphrey, PP Selective somatostatin sst(2) receptor blockade with the novel cyclic octapeptide, CYN-154806. Neuropharmacology 39:1443-50 (2000)  
Target
Name:
Somatostatin receptor type 2
Synonyms:
SOMATOSTATIN SST2 SS-2-R SS2R SSTR2 | Somatostatin receptor type 2 (SSTR2)
Type:
Enzyme
Mol. Mass.:
41344.94
Organism:
Homo sapiens (Human)
Description:
P30874
Residue:
369
  
Inhibitor
Name:
BDBM85671
Synonyms:
CAS_183658-72-2 CYN-154806
Type:
Small organic molecule
Emp. Form.:
C56H68N12O14S2
Mol. Mass.:
1197.341
SMILES:
C[C@@H](O)[C@@H]1NC(=O)[C@H](CCCCN)NC(=O)[C@@H](Cc2c[nH]c3ccccc23)NC(=O)[C@H](Cc2ccc(O)cc2)NC(=O)[C@@H](CSSC[C@H](NC1=O)C(=O)N[C@H](Cc1ccc(O)cc1)C(N)=O)NC(=O)[C@H](Cc1ccc(cc1)[N+]([O-])=O)NC(C)=O
: