Target
Dimer of Gag-Pol polyprotein [489-587]
Ligand
BDBM3422
Substrate
Chromogenic Peptide Substrate
Meas. Tech.
Protease Inhibition Assay
pH
5.6±n/a
Temperature
310.15±n/a K
Ki
90±33 nM
Citation
 Reich, SHMelnick, MDavies, JFAppelt, KLewis, KKFuhry, MAPino, MTrippe, AJNguyen, DDawson, H Protein structure-based design of potent orally bioavailable, nonpeptide inhibitors of human immunodeficiency virus protease. Proc Natl Acad Sci U S A 92:3298-302 (1995)  
Target
Name:
Dimer of Gag-Pol polyprotein [489-587]
Synonyms:
HIV-1 Protease
Type:
Protein Complex
Mol. Mass.:
Description:
Components:
This complex has 2 components.
Component 1
Name:
Gag-Pol polyprotein [489-587]
Synonyms:
HIV protease HIV-1 Protease chain A POL_HV1N5 | gag-pol
Type:
Enzyme Subunit
Mol. Mass.:
10822.21
Organism:
Human immunodeficiency virus type 1
Description:
P12497[489-587]
Residue:
99
  
Component 2
Name:
Gag-Pol polyprotein [489-587]
Synonyms:
HIV protease HIV-1 Protease chain A POL_HV1N5 | gag-pol
Type:
Enzyme Subunit
Mol. Mass.:
10822.21
Organism:
Human immunodeficiency virus type 1
Description:
P12497[489-587]
Residue:
99
  
Inhibitor
Name:
BDBM3422
Synonyms:
N-tert-butyl-2-(3-hydroxy-4-{2-[(2-hydroxyethyl)(2-phenylpropan-2-yl)carbamoyl]phenyl}butyl)-N-(2-hydroxyethyl)benzamide diarylbutanol deriv. 10
Type:
Small organic molecule
Emp. Form.:
C35H46N2O5
Mol. Mass.:
574.7501
SMILES:
CC(C)(C)N(CCO)C(=O)c1ccccc1CCC(O)Cc1ccccc1C(=O)N(CCO)C(C)(C)c1ccccc1
:
Substrate
Name:
Chromogenic Peptide Substrate
Synonyms:
Type:
Peptide
Mol. Mass.:
3763.66
Organism:
Description:
Residue:
35