Target
Muscarinic acetylcholine receptor M3
Ligand
BDBM82372
Substrate
Ki
0.51±n/a nM
Comments
PDSP_983
Citation
 Hirose, HAoki, IKimura, TFujikawa, TNumazawa, TSasaki, KSato, AHasegawa, TNishikibe, MMitsuya, MOhtake, NMase, TNoguchi, K Pharmacological properties of (2R)-N-[1-(6-aminopyridin-2-ylmethyl)piperidin-4-yl]-2-[(1R)-3,3-difluorocyclopentyl]-2-hydroxy-2-phenylacetamide: a novel mucarinic antagonist with M(2)-sparing antagonistic activity. J Pharmacol Exp Ther 297:790-7 (2001) Target
Name:
Muscarinic acetylcholine receptor M3
Synonyms:
ACM3_HUMAN Cholinergic, muscarinic M3 Muscarinic receptor M3 | RecName: Full=Muscarinic acetylcholine receptor M3
Type:
Enzyme
Mol. Mass.:
66151.03
Organism:
Homo sapiens (Human)
Description:
P20309
Residue:
590
  
Inhibitor
Name:
BDBM82372
Synonyms:
CAS_22254-24-6 NSC_3746
Type:
Small organic molecule
Emp. Form.:
C20H30NO3
Mol. Mass.:
332.4566
SMILES:
CC(C)[N+]1(C)C2CCC1CC(C2)OC(=O)C(CO)c1ccccc1
: