Target
Alpha-2B adrenergic receptor
Ligand
BDBM31046
Substrate
Ki
24.1±n/a nM
Comments
PDSP_1479
Citation
 Naselsky, DPAshton, DRuffolo, RRHieble, JP Rabbit alpha2-adrenoceptors: both platelets and adipocytes have alpha2A-pharmacology. J Pharmacol Exp Ther 298:219-25 (2001) Target
Name:
Alpha-2B adrenergic receptor
Synonyms:
ADA2B_RABIT Alpha-2B adrenergic receptor | adrenergic Alpha2
Type:
Enzyme Catalytic Domain
Mol. Mass.:
42909.14
Organism:
RABBIT
Description:
adrenergic Alpha2 0 RABBIT::O77830
Residue:
394
  
Inhibitor
Name:
BDBM31046
Synonyms:
3-[4,5-dihydro-1H-imidazol-2-ylmethyl-(4-methylphenyl)amino]phenol;methanesulfonic acid 3-[N-(2-imidazolin-2-ylmethyl)-4-methyl-anilino]phenol;mesylic acid MLS000069487 PHENTOLAMINE MESYLATE cid_5775 | cid_91430
Type:
Small organic molecule
Emp. Form.:
C17H19N3O
Mol. Mass.:
281.3523
SMILES:
Cc1ccc(cc1)N(CC1=NCCN1)c1cccc(O)c1
: