Target
AP-4 complex subunit sigma-1
Ligand
BDBM86757
Substrate
Ki
59.1±n/a nM
Comments
PDSP_7627
Citation
 Kumar, JSPrabhakaran, JMajo, VJMilak, MSHsiung, SCTamir, HSimpson, NRVan Heertum, RLMann, JJParsey, RV Synthesis and in vivo evaluation of a novel 5-HT1A receptor agonist radioligand [O-methyl- 11C]2-(4-(4-(2-methoxyphenyl)piperazin-1-yl)butyl)-4-methyl-1,2,4-triazine-3,5(2H,4H)dione in nonhuman primates. Eur J Nucl Med Mol Imaging 34:1050-60 (2007)  
Target
Name:
AP-4 complex subunit sigma-1
Synonyms:
AP-4 complex subunit sigma-1 AP4S1_BOVIN | Sigma-1
Type:
Enzyme Catalytic Domain
Mol. Mass.:
16986.01
Organism:
BOVINE
Description:
Sigma-1 0 BOVINE::Q3ZBB6
Residue:
144
  
Inhibitor
Name:
BDBM86757
Synonyms:
CAS_0 [11C]MMP
Type:
Small organic molecule
Emp. Form.:
C19H27N5O3
Mol. Mass.:
373.4494
SMILES:
COc1ccccc1N1CCN(CCCCn2ncc(=O)n(C)c2=O)CC1
: