Target
Prolyl 4-hydroxylase subunit alpha-1
Ligand
BDBM74208
Substrate
Meas. Tech.
Inhibition Assay
Ki
530000±0.0 nM
Citation
 Majamaa, KGünzler, VHanauske-Abel, HMMyllylä, RKivirikko, KI Partial identity of the 2-oxoglutarate and ascorbate binding sites of prolyl 4-hydroxylase. J Biol Chem 261:7819-23 (1986) Target
Name:
Prolyl 4-hydroxylase subunit alpha-1
Synonyms:
P4HA P4HA1_CHICK Prolyl 4-hydroxylase subunit alpha-1
Type:
Protein
Mol. Mass.:
59433.79
Organism:
Gallus gallus (Chicken)
Description:
P16924
Residue:
516
  
Inhibitor
Name:
BDBM74208
Synonyms:
2,4-bis(oxidanyl)benzoic acid MLS001055408 beta-Resorcylic acid | cid_1491
Type:
Small organic molecule
Emp. Form.:
C7H6O4
Mol. Mass.:
154.1201
SMILES:
OC(=O)c1ccc(O)cc1O
: