Target
Serine/threonine-protein kinase pim-3
Ligand
BDBM50299245
Substrate
Meas. Tech.
Inhibition Assay
IC50
4e+1±n/a nM
Citation
 Anizon, FMoreau, PPrudhomme, MCohen, PAboab, BAkue-Gedu, RRossignol, E Pyrrolo[2,3-a] carbazoles and use thereof as PIM kinase inhibitors US Patent  US8481586 Publication Date 7/9/2013 
Target
Name:
Serine/threonine-protein kinase pim-3
Synonyms:
PIM3 Serine/threonine-protein kinase pim-3 (PIM3)
Type:
Protein
Mol. Mass.:
35888.19
Organism:
Homo sapiens (Human)
Description:
Q86V86
Residue:
326
  
Inhibitor
Name:
BDBM50299245
Synonyms:
7-Bromo-1,10-dihydropyrrolo[2,3-a]carbazole-3-carbaldehyde US8481586, 16
Type:
Small organic molecule
Emp. Form.:
C15H9BrN2O
Mol. Mass.:
313.149
SMILES:
Brc1ccc2[nH]c3c(ccc4c(C=O)c[nH]c34)c2c1
: