Target
Polymerase acidic protein [1-204,T86I,G186S]
Ligand
BDBM105200
Substrate
Meas. Tech.
Fragment Screening
IC50
3.8e+2±n/a nM
Citation
 Bauman, JDPatel, DBaker, SFVijayan, RSXiang, AParhi, AKMartínez-Sobrido, LMartínez-Sobrido, EJDas, KArnold, E Crystallographic fragment screening and structure-based optimization yields a new class of influenza endonuclease inhibitors. ACS Chem Biol 8:2501-8 (2013)  
Target
Name:
Polymerase acidic protein [1-204,T86I,G186S]
Synonyms:
2009 H1N1 Influenza polymerase acidic protein N-terminal endonuclease domain PA | PA_I80A6
Type:
Protein
Mol. Mass.:
28455.35
Organism:
2009 H1N1 Influenza
Description:
P13166[1-204,T86I,G186S]
Residue:
241
  
Inhibitor
Name:
BDBM105200
Synonyms:
6-Phenyl-3-hydroxypyridin-2(1H)-one (Compound 4)
Type:
Small organic molecule
Emp. Form.:
C11H9NO2
Mol. Mass.:
187.1947
SMILES:
Oc1ccc([nH]c1=O)-c1ccccc1
: