Target
Dipeptidyl peptidase 4
Ligand
BDBM106756
Substrate
Meas. Tech.
In vitro DPP IV enzyme inhibition assay
Temperature
310.15±n/a K
IC50
6.49e+3±n/a nM
Comments
extracted
Citation
 Sharma, MGupta, MSingh, DKumar, MKaur, P Synthesis, evaluation and molecular docking of prolyl-fluoropyrrolidine derivatives as dipeptidyl peptidase IV inhibitors. Chem Biol Drug Des 82:156-66 (2013)  
Target
Name:
Dipeptidyl peptidase 4
Synonyms:
ADABP Adenosine deaminase complexing protein 2 CD_antigen=CD26 DPP4 DPPIV Dipeptidyl peptidase 4 (DPP IV) Dipeptidyl peptidase 4 (DPP4) Dipeptidyl peptidase 4 membrane form Dipeptidyl peptidase IV Dipeptidyl peptidase IV (DDP-IV) Dipeptidyl peptidase IV membrane form Dipeptidyl peptidase-IV (DPP-4) T-cell activation antigen CD26 | TP103
Type:
Enzyme
Mol. Mass.:
88271.01
Organism:
Homo sapiens (Human)
Description:
P27487
Residue:
766
  
Inhibitor
Name:
BDBM106756
Synonyms:
(3-Fluoro-pyrrolidin-1-yl)-[1-(2-piperidin-1-yl-ethyl)- pyrrolidin-2-yl]-methanone (Compound 14) | 1‐{2‐[2‐(3‐fluoropyrrolidine‐1‐carbonyl)pyrrolidin‐1‐ yl]ethyl}piperidine
Type:
Small organic molecule
Emp. Form.:
C16H28FN3O
Mol. Mass.:
297.4114
SMILES:
FC1CCN(C1)C(=O)C1CCCN1CCN1CCCCC1
: