Target
Dipeptidyl peptidase 4
Ligand
BDBM106757
Substrate
Meas. Tech.
In vitro DPP IV enzyme inhibition assay
Temperature
310.15±n/a K
IC50
2.384e+4±n/a nM
Comments
extracted
Citation
 Sharma, MGupta, MSingh, DKumar, MKaur, P Synthesis, evaluation and molecular docking of prolyl-fluoropyrrolidine derivatives as dipeptidyl peptidase IV inhibitors. Chem Biol Drug Des 82:156-66 (2013)  
Target
Name:
Dipeptidyl peptidase 4
Synonyms:
ADABP Adenosine deaminase complexing protein 2 CD_antigen=CD26 DPP4 DPPIV Dipeptidyl peptidase 4 (DPP IV) Dipeptidyl peptidase 4 (DPP4) Dipeptidyl peptidase 4 membrane form Dipeptidyl peptidase IV Dipeptidyl peptidase IV (DDP-IV) Dipeptidyl peptidase IV membrane form Dipeptidyl peptidase-IV (DPP-4) T-cell activation antigen CD26 | TP103
Type:
Enzyme
Mol. Mass.:
88271.01
Organism:
Homo sapiens (Human)
Description:
P27487
Residue:
766
  
Inhibitor
Name:
BDBM106757
Synonyms:
[1-(2-Diethylamino-ethyl)-pyrrolidin-2-yl]-(3-fluoropyrrolidin- 1-yl)-methanone (Compound 15) | diethyl({2‐[2‐(3‐fluoropyrrolidine‐1‐ carbonyl)pyrrolidin‐1‐yl]ethyl})amine
Type:
Small organic molecule
Emp. Form.:
C15H28FN3O
Mol. Mass.:
285.4007
SMILES:
CCN(CC)CCN1CCCC1C(=O)N1CCC(F)C1
: